BDBM50170985 (S)-4-[(S)-4-(R)-Carbamoyl-1-(4-carboxymethoxy-benzyl)-6-methyl-2-oxo-heptylcarbamoyl]-4-[2-(5-methyl-2,4-dioxo-3,4-dihydro-2H-pyrimidin-1-yl)-acetylamino]-butyric acid benzyl ester::CHEMBL365312
SMILES CC(C)C[C@H](CC(=O)[C@H](Cc1ccc(OCC(O)=O)cc1)NC(=O)[C@H](CCC(=O)OCc1ccccc1)NC(=O)Cn1cc(C)c(=O)[nH]c1=O)C(N)=O
InChI Key InChIKey=FMAYQRMLHZJHIH-FGUUHEIUSA-N
Data  2 IC50
  Tab Delimited (TSV)   2D SDfile   Computed 3D by Vconf -m prep SDfile
Find this compound or compounds like it in BindingDB:
Activity Spreadsheet -- Enzyme Inhibition Constant Data from BindingDB
Found 1 hit for monomerid = 50170985
TargetTyrosine-protein phosphatase non-receptor type 1(Homo sapiens (Human))
Nih
Curated by ChEMBL
LigandPNGBDBM50170985((S)-4-[(S)-4-(R)-Carbamoyl-1-(4-carboxymethoxy-ben...)
Affinity DataIC50: >1.00E+5nM. Assay description: Inhibitory concentration against human PTP1B expressed in Escherichia coli BL21 cells
In DepthDetails ArticlePubMed